BDBM50367736 CHEMBL1202530
SMILES O=C1N(CCCCN2CCN(CC2)c2ncccn2)C(=O)C23C4CCC(C4)C12C1CCC3C1
InChI Key InChIKey=OSVVGECYSBZWFD-UHFFFAOYSA-N
Data  1 KI
  Tab Delimited (TSV)   2D SDfile   Computed 3D by Vconf -m prep SDfile
Find this compound or compounds like it in BindingDB:
Activity Spreadsheet -- Enzyme Inhibition Constant Data from BindingDB
Found 1 hit for monomerid = 50367736
Target5-hydroxytryptamine receptor 1A(Rattus norvegicus (rat))
Wyeth-Ayerst Research
Curated by ChEMBL
LigandPNGBDBM50367736(CHEMBL1202530)
Affinity DataKi:  7nM. Assay description: In vitro inhibition of [3H]spiperone binding to 5-hydroxytryptamine 1A receptor from rat hippocampal tissue.
In DepthDetails ArticlePubMed