BDBM50368062 CHEMBL1907915
SMILES CCN1CCC[C@@H]1CNC(=O)c1c(O)c(Br)cc(OC)c1OC
InChI Key InChIKey=WGLPSCZHULDZSS-SNVBAGLBSA-N
Data  1 KI  1 IC50
  Tab Delimited (TSV)   2D SDfile   Computed 3D by Vconf -m prep SDfile
Find this compound or compounds like it in BindingDB:
Activity Spreadsheet -- Enzyme Inhibition Constant Data from BindingDB
Found 2 hits for monomerid = 50368062
TargetD(2) dopamine receptor(Rattus norvegicus (rat))
Astra Research Centre
Curated by ChEMBL
LigandPNGBDBM50368062(CHEMBL1907915)
Affinity DataKi:  6.5nM. Assay description: Inhibition of [3H]spiperone binding to rat striatal membrane Dopamine receptor D2
In DepthDetails ArticlePubMed
TargetD(2) dopamine receptor(Rattus norvegicus (rat))
Astra Research Centre
Curated by ChEMBL
LigandPNGBDBM50368062(CHEMBL1907915)
Affinity DataIC50:  79nM. Assay description: In vitro ability to inhibit the binding of [3H]spiperone to dopamine receptor D2 in rat striatal membranes.
In DepthDetails ArticlePubMed