BDBM50368073 CHEMBL1907690
SMILES CCN1CCC[C@H]1CNC(=O)c1c(O)c(OC)cc(Br)c1OC
InChI Key InChIKey=UFZPFNGITSAOBL-JTQLQIEISA-N
Data  1 KI  1 IC50
  Tab Delimited (TSV)   2D SDfile   Computed 3D by Vconf -m prep SDfile
Find this compound or compounds like it in BindingDB:
Activity Spreadsheet -- Enzyme Inhibition Constant Data from BindingDB
Found 2 hits for monomerid = 50368073
TargetD(2) dopamine receptor(Rattus norvegicus (rat))
Astra Research Centre
Curated by ChEMBL
LigandPNGBDBM50368073(CHEMBL1907690)
Affinity DataKi:  8.40nM. Assay description: Inhibition of [3H]spiperone binding to rat striatal membrane Dopamine receptor D2
In DepthDetails ArticlePubMed
TargetD(2) dopamine receptor(Rattus norvegicus (rat))
Astra Research Centre
Curated by ChEMBL
LigandPNGBDBM50368073(CHEMBL1907690)
Affinity DataIC50:  67nM. Assay description: In vitro ability to inhibit the binding of [3H]spiperone to dopamine receptor D2 in rat striatal membranes.
In DepthDetails ArticlePubMed