BDBM50368162 CHEMBL1790846
SMILES CC[C@H](C)[C@H](NC(=O)C[C@H](O)[C@H](CC(C)C)NC(=O)CC1C=CCN2N1C(=O)C(CNCc1ccccc1)CCC2=O)C(=O)N[C@@H](Cc1ccccc1)C(=O)OC
InChI Key InChIKey=OJNSACUSVZKEJK-DNVKVCAFSA-N
Data  1 IC50
  Tab Delimited (TSV)   2D SDfile   Computed 3D by Vconf -m prep SDfile
Find this compound or compounds like it in BindingDB:
Activity Spreadsheet -- Enzyme Inhibition Constant Data from BindingDB
Found 1 hit for monomerid = 50368162
TargetGag-Pol polyprotein [489-587](Human immunodeficiency virus type 1)
University Of Illinois
Curated by ChEMBL
LigandPNGBDBM50368162(CHEMBL1790846)
Affinity DataIC50:  1.40E+5nM. Assay description: Concentration required to inhibit HIV-1 protease activity calculated from plots of % inhibition vs inhibitor concentration
In DepthDetails ArticlePubMed