BDBM50368163 CHEMBL545098
SMILES CCCN(CCC)[C@@H]1C[C@@H]1c1cccc(O)c1
InChI Key InChIKey=SGAIAYHFAITRSL-HUUCEWRRSA-N
Data  1 KI
  Tab Delimited (TSV)   2D SDfile   Computed 3D by Vconf -m prep SDfile
Find this compound or compounds like it in BindingDB:
Activity Spreadsheet -- Enzyme Inhibition Constant Data from BindingDB
Found 1 hit for monomerid = 50368163
Target5-hydroxytryptamine receptor 1A(Rattus norvegicus (rat))
Uppsala University
Curated by ChEMBL
LigandPNGBDBM50368163(CHEMBL545098)
Affinity DataKi:  501nM. Assay description: Binding affinity at 5-hydroxytryptamine 1A receptor by the displacement of [3H]8-OH-DPAT in rat brain.
In DepthDetails ArticlePubMed