BDBM50368196 CHEMBL2236005::CHEMBL605174
SMILES COc1ccc2C(CCCc2c1)Nc1ncnc2n(cnc12)[C@@H]1O[C@H](CO)[C@@H](O)[C@H]1O
InChI Key InChIKey=BXOVOPVQYZMELM-RXHHNXKZSA-N
Data  2 KI
  Tab Delimited (TSV)   2D SDfile   Computed 3D by Vconf -m prep SDfile
Find this compound or compounds like it in BindingDB:
Activity Spreadsheet -- Enzyme Inhibition Constant Data from BindingDB
Found 2 hits for monomerid = 50368196
TargetAdenosine receptor A1(Rattus norvegicus (rat))
Warner-Lambert
Curated by ChEMBL
LigandPNGBDBM50368196(CHEMBL2236005 | CHEMBL605174)
Affinity DataKi:  72nM. Assay description: Binding affinity towards adenosine A1 receptor
In DepthDetails ArticlePubMed
TargetAdenosine receptor A2a/A2b(Rattus norvegicus)
Warner-Lambert
Curated by ChEMBL
LigandPNGBDBM50368196(CHEMBL2236005 | CHEMBL605174)
Affinity DataKi:  2.95E+3nM. Assay description: Binding affinity towards adenosine A2 receptor
In DepthDetails ArticlePubMed