BDBM50368296 CHEMBL608607
SMILES Nc1ncnc2n(cnc12)C1O[C@H](CSCCCl)[C@@H](O)[C@H]1O
InChI Key InChIKey=FVGIUFRYMWAPRK-PUXKXDTASA-N
Data  1 KI
  Tab Delimited (TSV)   2D SDfile   Computed 3D by Vconf -m prep SDfile
Find this compound or compounds like it in BindingDB:
Activity Spreadsheet -- Enzyme Inhibition Constant Data from BindingDB
Found 1 hit for monomerid = 50368296
TargetS-methyl-5'-thioadenosine phosphorylase(Mus musculus)
Institute
Curated by ChEMBL
LigandPNGBDBM50368296(CHEMBL608607)
Affinity DataKi:  1.20E+4nM. Assay description: The inhibitory constant(Ki) for MTA phosphorylase activity was determined by using a mouse liver enzyme preparation
In DepthDetails ArticlePubMed