BDBM50368354 2-(l-hexyn-l-yl)-adenosine-5'-N-methyluronamide (31)::CHEMBL608033
SMILES CCCCC#Cc1nc(N)c2ncn(C3O[C@H](CNC(=S)NC)[C@@H](O)[C@H]3O)c2n1
InChI Key InChIKey=BHVKZSLIKGUWGD-NVONZOAYSA-N
Data  3 KI
  Tab Delimited (TSV)   2D SDfile   Computed 3D by Vconf -m prep SDfile
Find this compound or compounds like it in BindingDB:
Activity Spreadsheet -- Enzyme Inhibition Constant Data from BindingDB
Found 3 hits for monomerid = 50368354
TargetAdenosine receptor A2a(Rattus norvegicus (rat))
Hokkaido University
Curated by ChEMBL
LigandPNGBDBM50368354(2-(l-hexyn-l-yl)-adenosine-5'-N-methyluronamide (3...)
Affinity DataKi: >181nM. Assay description: Binding affinity against adenosine A1 receptor from rat brain membranes using [3H]cyclohexyladenosine as radioligand.
In DepthDetails ArticlePubMed
TargetAdenosine receptor A2a/A2b(Rattus norvegicus)
Hokkaido University
Curated by ChEMBL
LigandPNGBDBM50368354(2-(l-hexyn-l-yl)-adenosine-5'-N-methyluronamide (3...)
Affinity DataKi: >181nM. Assay description: Binding affinity against adenosine A2 receptor from rat striatum using [3H]NECA as radioligand.
In DepthDetails ArticlePubMed
TargetAdenosine receptor A1(Rattus norvegicus (rat))
Hokkaido University
Curated by ChEMBL
LigandPNGBDBM50368354(2-(l-hexyn-l-yl)-adenosine-5'-N-methyluronamide (3...)
Affinity DataKi: >472nM. Assay description: Binding affinity against adenosine A1 receptor from rat brain membranes using [3H]cyclohexyladenosine as radioligand.
In DepthDetails ArticlePubMed