BDBM50368373 CHEMBL1202942
SMILES CN(C)CCCN1C(SCC1=O)c1cccc(C)c1
InChI Key InChIKey=JQTGFYQIDVWXPH-UHFFFAOYSA-N
Data  1 IC50
  Tab Delimited (TSV)   2D SDfile   Computed 3D by Vconf -m prep SDfile
Find this compound or compounds like it in BindingDB:
Activity Spreadsheet -- Enzyme Inhibition Constant Data from BindingDB
Found 1 hit for monomerid = 50368373
TargetHistamine H1 receptor(Cavia porcellus (domestic guinea pig))
Universit£
Curated by ChEMBL
LigandPNGBDBM50368373(CHEMBL1202942)
Affinity DataIC50:  5.00E+3nM. Assay description: In vitro for histamine H1 receptor antagonist activity against histamine-induced contractions on isolated guinea pig ileum
In DepthDetails ArticlePubMed