BDBM50368408 CHEMBL1790891::CHEMBL3349501
SMILES [H][C@@](O)(CN1CCCC1C(=O)N[C@@H]([C@@H](C)CC)C(=O)NCCc1ccccn1)[C@H](Cc1ccccc1)NC(=O)[C@H](CC(N)=O)NC(=O)c1ccc2ccccc2n1
InChI Key InChIKey=IFXYFJYLXAUGGL-WNASKWAVSA-N
Data  1 KI
  Tab Delimited (TSV)   2D SDfile   Computed 3D by Vconf -m prep SDfile
Find this compound or compounds like it in BindingDB:
Activity Spreadsheet -- Enzyme Inhibition Constant Data from BindingDB
Found 1 hit for monomerid = 50368408
TargetGag-Pol polyprotein [489-587](Human immunodeficiency virus type 1)
University Of Wisconsin-Madison
Curated by ChEMBL
LigandPNGBDBM50368408(CHEMBL1790891 | CHEMBL3349501)
Affinity DataKi:  13nM. Assay description: Binding affinity to HIV protease
In DepthDetails ArticlePubMed