BDBM50368428 CHEMBL1790878::CHEMBL3349489
SMILES [H][C@@](O)(CN1CCCC1C(=O)N[C@@H]([C@@H](C)CC)C(=O)N[C@@H](C(C)C)C(=O)OC)[C@H](Cc1ccccc1)NC(=O)[C@H](CC(N)=O)NC(=O)[C@H](Cc1ccc2ccccc2c1)NC(=O)OC(C)(C)C
InChI Key InChIKey=DENZMIJKOPPLPN-ZGVMPEEESA-N
Data  1 KI
  Tab Delimited (TSV)   2D SDfile   Computed 3D by Vconf -m prep SDfile
Find this compound or compounds like it in BindingDB:
Activity Spreadsheet -- Enzyme Inhibition Constant Data from BindingDB
Found 1 hit for monomerid = 50368428
TargetGag-Pol polyprotein [489-587](Human immunodeficiency virus type 1)
University Of Wisconsin-Madison
Curated by ChEMBL
LigandPNGBDBM50368428(CHEMBL1790878 | CHEMBL3349489)
Affinity DataKi:  7.80nM. Assay description: Binding affinity to HIV protease
In DepthDetails ArticlePubMed