BDBM50368456 CHEMBL604406
SMILES CCNc1ncnc2n(cnc12)C1O[C@H](CO)[C@@H](O)[C@H]1O
InChI Key InChIKey=SHXVYOLWYFZWKE-PUXKXDTASA-N
Data  2 KI
  Tab Delimited (TSV)   2D SDfile   Computed 3D by Vconf -m prep SDfile
Find this compound or compounds like it in BindingDB:
Activity Spreadsheet -- Enzyme Inhibition Constant Data from BindingDB
Found 2 hits for monomerid = 50368456
TargetAdenosine receptor A1(Rattus norvegicus (rat))
National Institute Of Diabetes
Curated by ChEMBL
LigandPNGBDBM50368456(CHEMBL604406)
Affinity DataKi:  49nM. Assay description: Affinity for adenosine A1 receptor at rat cortical receptors using 1 nM [3H]PIA
In DepthDetails ArticlePubMed
TargetAdenosine receptor A2a/A2b(Rattus norvegicus)
National Institute Of Diabetes
Curated by ChEMBL
LigandPNGBDBM50368456(CHEMBL604406)
Affinity DataKi:  8.90E+3nM. Assay description: Affinity for adenosine A2 receptor at rat striatal membrane using 5 nM [3H]CGS-21680
In DepthDetails ArticlePubMed