BDBM50368477 CHEMBL607592
SMILES Nc1nc(N=NCCc2ccccc2)nc2n(cnc12)C1O[C@H](CO)[C@@H](O)[C@H]1O
InChI Key InChIKey=NHPOMSDUUBJIND-IKYDMHQPSA-N
Data  1 EC50
  Tab Delimited (TSV)   2D SDfile   Computed 3D by Vconf -m prep SDfile
Find this compound or compounds like it in BindingDB:
Activity Spreadsheet -- Enzyme Inhibition Constant Data from BindingDB
Found 1 hit for monomerid = 50368477
TargetAdenosine receptor A1(GUINEA PIG)
University Of South Florida
Curated by ChEMBL
LigandPNGBDBM50368477(CHEMBL607592)
Affinity DataEC50:  8.32E+4nM. Assay description: Tested for adenosine A1 receptor agonistic activity by determining concentration needed to prolong the stimulus-QRS interval by 50% of the maximum re...Checked by Author
In DepthDetails ArticlePubMed