BDBM50368478 CHEMBL610444
SMILES NNc1nc(N)c2ncn(C3O[C@H](CO)[C@@H](O)[C@H]3O)c2n1
InChI Key InChIKey=BAYFDGKAUSOEIS-LZGMGDPASA-N
Data  3 EC50
  Tab Delimited (TSV)   2D SDfile   Computed 3D by Vconf -m prep SDfile
Find this compound or compounds like it in BindingDB:
Activity Spreadsheet -- Enzyme Inhibition Constant Data from BindingDB
Found 3 hits for monomerid = 50368478
TargetAdenosine receptor A1(GUINEA PIG)
University Of South Florida
Curated by ChEMBL
LigandPNGBDBM50368478(CHEMBL610444)
Affinity DataEC50:  2.00E+4nM. Assay description: Tested for adenosine A1 receptor agonistic activity by determining concentration needed to prolong the stimulus-QRS interval by 50% of the maximum re...Checked by Author
In DepthDetails ArticlePubMed
TargetAdenosine receptor A2a/A2b(Homo sapiens (Human))
University Of South Florida
Curated by ChEMBL
LigandPNGBDBM50368478(CHEMBL610444)
Affinity DataEC50:  79nM. Assay description: In vitro effect on coronary vasodilation in guinea pig heart.
In DepthDetails ArticlePubMed
TargetAdenosine receptor A1(GUINEA PIG)
University Of South Florida
Curated by ChEMBL
LigandPNGBDBM50368478(CHEMBL610444)
Affinity DataEC50:  2.00E+4nM. Assay description: In vitro prolonging of the stimulus-QRS interval in guinea pig heart.
In DepthDetails ArticlePubMed