BDBM50368488 CHEMBL611610
SMILES COc1ccc(CN=Nc2nc(N)c3ncn(C4O[C@H](CO)[C@@H](O)[C@H]4O)c3n2)cc1
InChI Key InChIKey=HXRNPPRITCUVAN-IKYDMHQPSA-N
Data  1 EC50
  Tab Delimited (TSV)   2D SDfile   Computed 3D by Vconf -m prep SDfile
Find this compound or compounds like it in BindingDB:
Activity Spreadsheet -- Enzyme Inhibition Constant Data from BindingDB
Found 1 hit for monomerid = 50368488
TargetAdenosine receptor A1(GUINEA PIG)
University Of South Florida
Curated by ChEMBL
LigandPNGBDBM50368488(CHEMBL611610)
Affinity DataEC50:  2.29E+4nM. Assay description: Tested for adenosine A1 receptor agonistic activity by determining concentration needed to prolong the stimulus-QRS interval by 50% of the maximum re...Checked by Author
In DepthDetails ArticlePubMed