BDBM50368565 CHEMBL1203806
SMILES CS(=O)(=O)NC(=O)c1ccc(nc1)C(O)=O
InChI Key InChIKey=IMOUUFFFEDKZPE-UHFFFAOYSA-N
Data  1 IC50
  Tab Delimited (TSV)   2D SDfile   Computed 3D by Vconf -m prep SDfile
Find this compound or compounds like it in BindingDB:
Activity Spreadsheet -- Enzyme Inhibition Constant Data from BindingDB
Found 1 hit for monomerid = 50368565
TargetTransmembrane prolyl 4-hydroxylase(Homo sapiens (Human))
Ici Pharmaceuticals Group
Curated by ChEMBL
LigandPNGBDBM50368565(CHEMBL1203806)
Affinity DataIC50:  1.80E+3nM. Assay description: Inhibition of prolyl 4-hydroxylase
In DepthDetails ArticlePubMed