BDBM50368682 CHEMBL1790784
SMILES CCC(CC)C(=O)N[C@@H]([C@@H](C)O)C(=O)N[C@@H](CC(=O)N1CCCC1)C(=O)N[C@@H](CC(O)=O)C(=O)N[C@@H](CC(C)C)C(O)=O
InChI Key InChIKey=AYWDZABMXCQZIU-KNCYDQBVSA-N
Data  1 IC50
  Tab Delimited (TSV)   2D SDfile   Computed 3D by Vconf -m prep SDfile
Find this compound or compounds like it in BindingDB:
Activity Spreadsheet -- Enzyme Inhibition Constant Data from BindingDB
Found 1 hit for monomerid = 50368682
TargetRibonucleoside-diphosphate reductase large subunit(Homo sapiens (Human))
Bio-M£Ga/Boehringer Ingelheim Research
Curated by ChEMBL
LigandPNGBDBM50368682(CHEMBL1790784)
Affinity DataIC50: >1.00E+6nM. Assay description: Tested for inhibition of human ribonucleotide reductase
In DepthDetails ArticlePubMed