BDBM50368710 CHEMBL607761
SMILES NC[C@H]1OC([C@H](O)[C@@H]1O)n1nc(I)c2c(N)ncnc12
InChI Key InChIKey=BOMYTWZKRUOTPD-RMXRYUSWSA-N
Data  1 KI
  Tab Delimited (TSV)   2D SDfile   Computed 3D by Vconf -m prep SDfile
Find this compound or compounds like it in BindingDB:
Activity Spreadsheet -- Enzyme Inhibition Constant Data from BindingDB
Found 1 hit for monomerid = 50368710
TargetAdenosine kinase(Homo sapiens (Human))
University Of California
Curated by ChEMBL
LigandPNGBDBM50368710(CHEMBL607761)
Affinity DataKi:  150nM. Assay description: Inhibition of human placental adenosine kinase
In DepthDetails ArticlePubMed