BDBM50368820 CHEMBL1203538
SMILES N#CC(C#N)C1=NCCN1CCNCc1ccc(CN2CCCCCC2)o1
InChI Key InChIKey=ZYXGFUNFZUUBPI-UHFFFAOYSA-N
Data  1 IC50
  Tab Delimited (TSV)   2D SDfile   Computed 3D by Vconf -m prep SDfile
Find this compound or compounds like it in BindingDB:
Activity Spreadsheet -- Enzyme Inhibition Constant Data from BindingDB
Found 1 hit for monomerid = 50368820
TargetAcetylcholinesterase(Homo sapiens (Human))
Kyowa Hakko Kogyo
Curated by ChEMBL
LigandPNGBDBM50368820(CHEMBL1203538)
Affinity DataIC50:  120nM. Assay description: Inhibition of guinea pig acetylcholinesterase
In DepthDetails ArticlePubMed