BDBM503690 US11034671, Example 83
SMILES CC1CCOc2ccc(cc2C(=O)Nc2cccc(n2)-c2nncn12)-c1ccc(nc1)C(F)F
InChI Key InChIKey=AMUWYWZLEKWONW-UHFFFAOYSA-N
Data  1 Kd
  Tab Delimited (TSV)   2D SDfile   Computed 3D by Vconf -m prep SDfile
Find this compound or compounds like it in BindingDB:
Activity Spreadsheet -- Enzyme Inhibition Constant Data from BindingDB
Found 1 hit for monomerid = 503690
TargetMitogen-activated protein kinase kinase kinase 5(Homo sapiens (Human))
Sichuan Haisco Pharmaceutical
US Patent
LigandPNGBDBM503690(US11034671, Example 83)
Affinity DataKd:  1.50E+3nM. Assay description: The binding of compounds to ASK1 were determined using DiscoverX's proprietary technology. KINOMEscan™ is based on a competition binding assay th...
Ligand InfoPC cidPC sid
In DepthDetails US Patent