BDBM50370130 CHEMBL1788229
SMILES CC[C@H]1CN2C(=N1)c1c(ncn1C)N(C)C2=O
InChI Key InChIKey=SRWDCZFXABRQMR-ZETCQYMHSA-N
Data  1 KI
  Tab Delimited (TSV)   2D SDfile   Computed 3D by Vconf -m prep SDfile
Find this compound or compounds like it in BindingDB:
Activity Spreadsheet -- Enzyme Inhibition Constant Data from BindingDB
Found 1 hit for monomerid = 50370130
TargetAdenosine receptor A2a(Rattus norvegicus (rat))
University Of Bonn
Curated by ChEMBL
LigandPNGBDBM50370130(CHEMBL1788229)
Affinity DataKi:  1.09E+4nM. Assay description: Binding affinity to the adenosine A2A receptor by displacement of [3H]CGS-21680 in rat brain striatal membrane
In DepthDetails ArticlePubMed