BDBM50370133 CHEMBL1788234
SMILES CC[C@H]1Cn2c(N1)c1nc(nc1n(C)c2=O)-c1ccccc1
InChI Key InChIKey=XNWDEMWJNJVCBD-NSHDSACASA-N
Data  3 KI
  Tab Delimited (TSV)   2D SDfile   Computed 3D by Vconf -m prep SDfile
Find this compound or compounds like it in BindingDB:
Activity Spreadsheet -- Enzyme Inhibition Constant Data from BindingDB
Found 3 hits for monomerid = 50370133
TargetAdenosine receptor A3(Homo sapiens (Human))
University Of Bonn
Curated by ChEMBL
LigandPNGBDBM50370133(CHEMBL1788234)
Affinity DataKi:  9.80nM. Assay description: Binding affinity against human recombinant Adenosine A3 receptor stably expressed in HEK293 cells by displacing [125I]AB-MECA radioligand
In DepthDetails ArticlePubMed
TargetAdenosine receptor A1(Rattus norvegicus (rat))
University Of Bonn
Curated by ChEMBL
LigandPNGBDBM50370133(CHEMBL1788234)
Affinity DataKi:  115nM. Assay description: Binding affinity against Adenosine A1 receptor by displacing [3H]CHA radioligand in rat brain cortical membrane
In DepthDetails ArticlePubMed
TargetAdenosine receptor A2a(Rattus norvegicus (rat))
University Of Bonn
Curated by ChEMBL
LigandPNGBDBM50370133(CHEMBL1788234)
Affinity DataKi:  3.33E+3nM. Assay description: Binding affinity to the adenosine A2A receptor by displacement of [3H]CGS-21680 in rat brain striatal membrane
In DepthDetails ArticlePubMed