BDBM50370179 CHEMBL4163007
SMILES CCCCCCCCCC(N)(OP(O)(O)=O)OP(O)(O)=O
InChI Key InChIKey=ACMKHUKRMFBPDJ-UHFFFAOYSA-N
Data  1 IC50
  Tab Delimited (TSV)   2D SDfile   Computed 3D by Vconf -m prep SDfile
Find this compound or compounds like it in BindingDB:
Activity Spreadsheet -- Enzyme Inhibition Constant Data from BindingDB
Found 1 hit for monomerid = 50370179
TargetSphingomyelin phosphodiesterase(Homo sapiens)
China Pharmaceutical University
Curated by ChEMBL
LigandPNGBDBM50370179(CHEMBL4163007)
Affinity DataIC50:  20nM. Assay description: Inhibition of acid sphingomyelinase in human HuH7 cell lysate using NBD-sphingomyelin as substrate after 30 mins by TLC based fluorescence assay
In DepthDetails ArticlePubMed