BDBM50370459 CHEMBL443732
SMILES [#7]-[#6@@H](-[#6]-[#6]-[#8]\[#7]=[#6](\[#7])-[#7])-[#6](-[#8])=O
InChI Key InChIKey=FSBIGDSBMBYOPN-VKHMYHEASA-N
Data  1 KI  1 IC50
  Tab Delimited (TSV)   2D SDfile   Computed 3D by Vconf -m prep SDfile
Find this compound or compounds like it in BindingDB:
Activity Spreadsheet -- Enzyme Inhibition Constant Data from BindingDB
Found 2 hits for monomerid = 50370459
TargetNitric oxide synthase, inducible(Homo sapiens (Human))
University Of California
Curated by ChEMBL
LigandPNGBDBM50370459(CHEMBL443732)
Affinity DataKi:  2.20E+5nM. Assay description: Binding affinity towards inducible nitric oxide synthase
In DepthDetails ArticlePubMed
TargetNitric oxide synthase, inducible(Mus musculus (mouse))
China Pharmaceutical University
Curated by ChEMBL
LigandPNGBDBM50370459(CHEMBL443732)
Affinity DataIC50:  6.00E+4nM. Assay description: Inhibition of inducible nitric oxide synthetase in LPS-stimulated mouse ANA1 macrophages
In DepthDetails ArticlePubMed