BDBM503707 US11034671, Example 101
SMILES FC(F)(F)c1ccc(cn1)-c1ccc2COCCCn3cnnc3-c3cccc(NC(=O)c2c1)n3
InChI Key InChIKey=CFSJGUQRCFFLBE-UHFFFAOYSA-N
Data  1 Kd
  Tab Delimited (TSV)   2D SDfile   Computed 3D by Vconf -m prep SDfile
Find this compound or compounds like it in BindingDB:
Activity Spreadsheet -- Enzyme Inhibition Constant Data from BindingDB
Found 1 hit for monomerid = 503707
TargetMitogen-activated protein kinase kinase kinase 5(Homo sapiens (Human))
Sichuan Haisco Pharmaceutical
US Patent
LigandPNGBDBM503707(US11034671, Example 101)
Affinity DataKd:  300nM. Assay description: The binding of compounds to ASK1 were determined using DiscoverX's proprietary technology. KINOMEscan™ is based on a competition binding assay th...
Ligand InfoPC cidPC sid
In DepthDetails US Patent