BDBM50370727 CHEMBL1791369
SMILES CC[C@@H](C)[C@@H]1NC(=O)[C@@H](CS)NC(=O)CCC(=O)Nc2ccc(cc2)[C@H](NC1=O)C(=O)N[C@@H](CCCCN)C(=O)N[C@@H](Cc1ccc(O)cc1)C(=O)N[C@@H](Cc1ccc(O)cc1)C(O)=O
InChI Key InChIKey=HFHVOHKEMBUZCY-UEOAKFEPSA-N
Data  1 IC50
  Tab Delimited (TSV)   2D SDfile   Computed 3D by Vconf -m prep SDfile
Find this compound or compounds like it in BindingDB:
Activity Spreadsheet -- Enzyme Inhibition Constant Data from BindingDB
Found 1 hit for monomerid = 50370727
TargetProto-oncogene tyrosine-protein kinase Src(Homo sapiens (Human))
University Of Rhode Island
Curated by ChEMBL
LigandPNGBDBM50370727(CHEMBL1791369)
Affinity DataIC50:  1.70E+4nM. Assay description: Inhibition of SRC using polyE4Y as substrate
In DepthDetails ArticlePubMed