BDBM50370732 CHEMBL1791365
SMILES CC[C@H](C)[C@@H]1NC(=O)[C@H](CS)NC(=O)CCC(=O)NCCCC[C@H](NC(=O)[C@H](Cc2ccc(O)cc2)NC1=O)C(=O)N[C@@H](Cc1ccc(O)cc1)C(=O)N[C@@H](Cc1ccc(O)cc1)C(O)=O
InChI Key InChIKey=UITYOZKZFPMQOF-NNQXNFOKSA-N
Data  1 IC50
  Tab Delimited (TSV)   2D SDfile   Computed 3D by Vconf -m prep SDfile
Find this compound or compounds like it in BindingDB:
Activity Spreadsheet -- Enzyme Inhibition Constant Data from BindingDB
Found 1 hit for monomerid = 50370732
TargetProto-oncogene tyrosine-protein kinase Src(Homo sapiens (Human))
University Of Rhode Island
Curated by ChEMBL
LigandPNGBDBM50370732(CHEMBL1791365)
Affinity DataIC50:  7.50E+4nM. Assay description: Inhibition of SRC using polyE4Y as substrate
In DepthDetails ArticlePubMed