BDBM50370781 CHEMBL374147
SMILES COc1cc(COCc2ccc(nc2)-n2cc(cn2)C(O)=O)cc(OC)c1
InChI Key InChIKey=IMNOAFRPQMXXMZ-UHFFFAOYSA-N
Data  1 IC50
  Tab Delimited (TSV)   2D SDfile   Computed 3D by Vconf -m prep SDfile
Find this compound or compounds like it in BindingDB:
Activity Spreadsheet -- Enzyme Inhibition Constant Data from BindingDB
Found 1 hit for monomerid = 50370781
TargetEgl nine homolog 1(Homo sapiens (Human))
Procter And Gamble Pharmaceuticals
Curated by ChEMBL
LigandPNGBDBM50370781(CHEMBL374147)
Affinity DataIC50:  2.80E+3nM. Assay description: Inhibition of human EGLN1
In DepthDetails ArticlePubMed