BDBM50370806 CHEMBL220695
SMILES OC(=O)c1cnn(c1)-c1ccc(cn1)-c1ccc(Cl)cc1
InChI Key InChIKey=FAYCSSACEXSLJR-UHFFFAOYSA-N
Data  1 IC50
  Tab Delimited (TSV)   2D SDfile   Computed 3D by Vconf -m prep SDfile
Find this compound or compounds like it in BindingDB:
Activity Spreadsheet -- Enzyme Inhibition Constant Data from BindingDB
Found 1 hit for monomerid = 50370806
TargetEgl nine homolog 1(Homo sapiens (Human))
Procter And Gamble Pharmaceuticals
Curated by ChEMBL
LigandPNGBDBM50370806(CHEMBL220695)
Affinity DataIC50:  2.00E+4nM. Assay description: Inhibition of EGLN1
In DepthDetails ArticlePubMed