BDBM50370827 CHEMBL374569
SMILES OC(=O)c1ccc2cccnc2c1O
InChI Key InChIKey=JYIAZVFJRYLCBH-UHFFFAOYSA-N
Data  1 IC50  1 EC50
  Tab Delimited (TSV)   2D SDfile   Computed 3D by Vconf -m prep SDfile
Find this compound or compounds like it in BindingDB:
Activity Spreadsheet -- Enzyme Inhibition Constant Data from BindingDB
Found 2 hits for monomerid = 50370827
TargetPolymerase acidic protein(Hepatitis C virus)
University Of Tennessee Health Science Center
Curated by ChEMBL
LigandPNGBDBM50370827(CHEMBL374569)
Affinity DataEC50: >2.50E+5nM. Assay description: Plaque growth inhibition
In DepthDetails ArticlePubMed
TargetEgl nine homolog 1(Homo sapiens (Human))
Procter And Gamble Pharmaceuticals
Curated by ChEMBL
LigandPNGBDBM50370827(CHEMBL374569)
Affinity DataIC50: >1.00E+5nM. Assay description: Inhibition of human EGLN1
In DepthDetails ArticlePubMed