BDBM503710 US11034671, Example 104
SMILES C[C@@H]1CCn2cnnc2-c2cccc(NC(=O)c3cc(ccc3OC1)-c1ccc(C)nc1)n2
InChI Key InChIKey=XFLUBYXJEYSWQO-MRXNPFEDSA-N
Data  1 Kd
  Tab Delimited (TSV)   2D SDfile   Computed 3D by Vconf -m prep SDfile
Find this compound or compounds like it in BindingDB:
Activity Spreadsheet -- Enzyme Inhibition Constant Data from BindingDB
Found 1 hit for monomerid = 503710
TargetMitogen-activated protein kinase kinase kinase 5(Homo sapiens (Human))
Sichuan Haisco Pharmaceutical
US Patent
LigandPNGBDBM503710(US11034671, Example 104)
Affinity DataKd: <100nM. Assay description: The binding of compounds to ASK1 were determined using DiscoverX's proprietary technology. KINOMEscan™ is based on a competition binding assay th...
Ligand InfoPC cidPC sid
In DepthDetails US Patent