BDBM50371286 CHEMBL401867
SMILES CNCc1cc(ccc1Oc1cccc(F)c1)C(=O)N1CCCN(CC1)C1CC1
InChI Key InChIKey=PIVRFBAMCBQCDZ-UHFFFAOYSA-N
Data  5 KI
  Tab Delimited (TSV)   2D SDfile   Computed 3D by Vconf -m prep SDfile
Find this compound or compounds like it in BindingDB:
Activity Spreadsheet -- Enzyme Inhibition Constant Data from BindingDB
Found 5 hits for monomerid = 50371286
TargetHistamine H3 receptor(Homo sapiens (Human))
Johnson & Johnson Pharmaceutical Research & Development
Curated by ChEMBL
LigandPNGBDBM50371286(CHEMBL401867)
Affinity DataKi:  1nM. Assay description: Inhibition of human histamine H3 receptor
In DepthDetails ArticlePubMed
TargetSodium-dependent serotonin transporter(Rattus norvegicus (rat))
Johnson & Johnson Pharmaceutical Research & Development
Curated by ChEMBL
LigandPNGBDBM50371286(CHEMBL401867)
Affinity DataKi:  39nM. Assay description: Inhibition of rat SERT
In DepthDetails ArticlePubMed
TargetSodium-dependent serotonin transporter(Homo sapiens (Human))
Johnson & Johnson Pharmaceutical Research & Development
Curated by ChEMBL
LigandPNGBDBM50371286(CHEMBL401867)
Affinity DataKi:  236nM. Assay description: Inhibition of human SERT
In DepthDetails ArticlePubMed
TargetSodium-dependent noradrenaline transporter(Homo sapiens (Human))
Johnson & Johnson Pharmaceutical Research & Development
Curated by ChEMBL
LigandPNGBDBM50371286(CHEMBL401867)
Affinity DataKi:  760nM. Assay description: Binding affinity to human NET
In DepthDetails ArticlePubMed
TargetSodium-dependent dopamine transporter(Homo sapiens (Human))
Johnson & Johnson Pharmaceutical Research & Development
Curated by ChEMBL
LigandPNGBDBM50371286(CHEMBL401867)
Affinity DataKi:  8.00E+3nM. Assay description: Binding affinity to human DAT
In DepthDetails ArticlePubMed