BDBM50371356 CHEMBL256681
SMILES Cc1cc(COc2ccc(cc2)C(=O)N[C@@H]2CN(C[C@@H]2C(=O)NO)S(C)(=O)=O)c2ccccc2n1
InChI Key InChIKey=YURFZWNLXFKRFO-RBBKRZOGSA-N
Data  3 KI  1 IC50
  Tab Delimited (TSV)   2D SDfile   Computed 3D by Vconf -m prep SDfile
Find this compound or compounds like it in BindingDB:
Activity Spreadsheet -- Enzyme Inhibition Constant Data from BindingDB
Found 4 hits for monomerid = 50371356
TargetMatrix metalloproteinase-9(Homo sapiens (Human))
Bristol-Myers Squibb Research And Development
Curated by ChEMBL
LigandPNGBDBM50371356(CHEMBL256681)
Affinity DataKi: >2.13E+3nM. Assay description: Binding affinity to MMP9
In DepthDetails ArticlePubMed
Target72 kDa type IV collagenase(Homo sapiens (Human))
Bristol-Myers Squibb Research And Development
Curated by ChEMBL
LigandPNGBDBM50371356(CHEMBL256681)
Affinity DataKi: >3.33E+3nM. Assay description: Binding affinity to MMP2
In DepthDetails ArticlePubMed
TargetInterstitial collagenase(Homo sapiens (Human))
Bristol-Myers Squibb Research And Development
Curated by ChEMBL
LigandPNGBDBM50371356(CHEMBL256681)
Affinity DataKi: >4.95E+3nM. Assay description: Binding affinity to MMP1
In DepthDetails ArticlePubMed
TargetDisintegrin and metalloproteinase domain-containing protein 17(Sus scrofa (pig))
Bristol-Myers Squibb Research And Development
Curated by ChEMBL
LigandPNGBDBM50371356(CHEMBL256681)
Affinity DataIC50:  1.60nM. Assay description: Inhibition of pig TACE
In DepthDetails ArticlePubMed