BDBM50371366 CHEMBL429760
SMILES C[C@H](Oc1cccc2ncnc(Nc3ccc(Oc4ccc(C)nc4)c(C)c3)c12)C(=O)N(C)C
InChI Key InChIKey=XNXUDGXKTVZKLB-SFHVURJKSA-N
Data  2 IC50
  Tab Delimited (TSV)   2D SDfile   Computed 3D by Vconf -m prep SDfile
Find this compound or compounds like it in BindingDB:
Activity Spreadsheet -- Enzyme Inhibition Constant Data from BindingDB
Found 2 hits for monomerid = 50371366
TargetReceptor tyrosine-protein kinase erbB-2(Homo sapiens (Human))
Astrazeneca
Curated by ChEMBL
LigandPNGBDBM50371366(CHEMBL429760)
Affinity DataIC50:  30nM. Assay description: Inhibition of ebrB2 expressed in human MCF7 cells by autophosphorylation assay
In DepthDetails ArticlePubMed
TargetPotassium voltage-gated channel subfamily H member 2(Homo sapiens (Human))
Astrazeneca
Curated by ChEMBL
LigandPNGBDBM50371366(CHEMBL429760)
Affinity DataIC50:  1.10E+4nM. Assay description: Inhibition of human ERG
In DepthDetails ArticlePubMed