BDBM50371487 CHEMBL270821
SMILES CCS(=O)(=O)CCN([C@H](C)c1nc(cn1-c1ccc(cc1)C#N)-c1ccccn1)C(=O)Cc1ccc(F)c(c1)C(F)(F)F
InChI Key InChIKey=XFIGITXJDHMERB-HXUWFJFHSA-N
Data  2 IC50
  Tab Delimited (TSV)   2D SDfile   Computed 3D by Vconf -m prep SDfile
Find this compound or compounds like it in BindingDB:
Activity Spreadsheet -- Enzyme Inhibition Constant Data from BindingDB
Found 2 hits for monomerid = 50371487
TargetC-X-C chemokine receptor type 3(Homo sapiens (Human))
Amgen
Curated by ChEMBL
LigandPNGBDBM50371487(CHEMBL270821)
Affinity DataIC50:  43nM. Assay description: Displacement of [125I]IP10 from human recombinant CXCR3 receptor expressed in IL2-activated human PBMC in presence of plasma
In DepthDetails ArticlePubMed
TargetC-X-C chemokine receptor type 3(Homo sapiens (Human))
Amgen
Curated by ChEMBL
LigandPNGBDBM50371487(CHEMBL270821)
Affinity DataIC50:  4nM. Assay description: Displacement of [125I]IP10 from human recombinant CXCR3 receptor expressed in IL2-activated human PBMC
In DepthDetails ArticlePubMed