BDBM50371514 CHEMBL401995
SMILES CCOc1ccc(cc1)-n1cc(nc1[C@@H](C)N(CCS(=O)(=O)CC)C(=O)Cn1nnc(n1)-c1ccc(F)cc1)-c1ccccc1
InChI Key InChIKey=CJAVNTLIYFPTSB-HSZRJFAPSA-N
Data  2 IC50
  Tab Delimited (TSV)   2D SDfile   Computed 3D by Vconf -m prep SDfile
Find this compound or compounds like it in BindingDB:
Activity Spreadsheet -- Enzyme Inhibition Constant Data from BindingDB
Found 2 hits for monomerid = 50371514
TargetC-X-C chemokine receptor type 3(Homo sapiens (Human))
Amgen
Curated by ChEMBL
LigandPNGBDBM50371514(CHEMBL401995)
Affinity DataIC50:  5nM. Assay description: Displacement of [125I]IP10 from human recombinant CXCR3 receptor expressed in IL2-activated human PBMC
In DepthDetails ArticlePubMed
TargetC-X-C chemokine receptor type 3(Homo sapiens (Human))
Amgen
Curated by ChEMBL
LigandPNGBDBM50371514(CHEMBL401995)
Affinity DataIC50:  47nM. Assay description: Displacement of [125I]IP10 from human recombinant CXCR3 receptor expressed in IL2-activated human PBMC in presence of plasma
In DepthDetails ArticlePubMed