BDBM50371646 CHEMBL403202
SMILES C[C@@H](NC(=O)C1(CC1)NC(=O)C(F)(F)F)c1ncc(cc1F)-c1cc(Cl)cc(Cl)c1OCC(F)F
InChI Key InChIKey=LLKPCYJBVUMKNP-SECBINFHSA-N
Data  1 KI
  Tab Delimited (TSV)   2D SDfile   Computed 3D by Vconf -m prep SDfile
Find this compound or compounds like it in BindingDB:
Activity Spreadsheet -- Enzyme Inhibition Constant Data from BindingDB
Found 1 hit for monomerid = 50371646
TargetB1 bradykinin receptor(Homo sapiens (Human))
Merck Research Laboratories
Curated by ChEMBL
LigandPNGBDBM50371646(CHEMBL403202)
Affinity DataKi:  1.5nM. Assay description: Binding affinity to human bradykinin B1 receptor expressed in rat CNS
In DepthDetails ArticlePubMed