BDBM50371649 CHEMBL404328
SMILES CCOc1c(Cl)cc(Cl)cc1-c1ccc([C@@H](C)NC(=O)C2(CC2)NC(=O)C(F)(F)F)c(F)c1
InChI Key InChIKey=DZASLXXZYIZLCE-LLVKDONJSA-N
Data  1 KI
  Tab Delimited (TSV)   2D SDfile   Computed 3D by Vconf -m prep SDfile
Find this compound or compounds like it in BindingDB:
Activity Spreadsheet -- Enzyme Inhibition Constant Data from BindingDB
Found 1 hit for monomerid = 50371649
TargetB1 bradykinin receptor(Homo sapiens (Human))
Merck Research Laboratories
Curated by ChEMBL
LigandPNGBDBM50371649(CHEMBL404328)
Affinity DataKi:  1.30nM. Assay description: Binding affinity to human bradykinin B1 receptor expressed in rat CNS
In DepthDetails ArticlePubMed