BDBM50371650 CHEMBL404683
SMILES CCOc1c(Cl)cccc1-c1ccc([C@@H](C)NC(=O)C2(CC2)NC(=O)C(F)(F)F)c(F)c1
InChI Key InChIKey=XSVAPUHZYSLGKD-GFCCVEGCSA-N
Data  1 KI
  Tab Delimited (TSV)   2D SDfile   Computed 3D by Vconf -m prep SDfile
Find this compound or compounds like it in BindingDB:
Activity Spreadsheet -- Enzyme Inhibition Constant Data from BindingDB
Found 1 hit for monomerid = 50371650
TargetB1 bradykinin receptor(Homo sapiens (Human))
Merck Research Laboratories
Curated by ChEMBL
LigandPNGBDBM50371650(CHEMBL404683)
Affinity DataKi:  0.900nM. Assay description: Binding affinity to human bradykinin B1 receptor expressed in rat CNS
In DepthDetails ArticlePubMed