BDBM503719 US11034678, Example 3.5
SMILES CCOc1nccnc1Oc1cncc(c1)-c1ncc(cn1)C(=O)NC(C)(C)CO
InChI Key InChIKey=AMQGVPYSEPUBLY-UHFFFAOYSA-N
Data  1 IC50
  Tab Delimited (TSV)   2D SDfile   Computed 3D by Vconf -m prep SDfile
Find this compound or compounds like it in BindingDB:
Activity Spreadsheet -- Enzyme Inhibition Constant Data from BindingDB
Found 1 hit for monomerid = 503719
TargetDiacylglycerol O-acyltransferase 2(Homo sapiens (Human))
Pfizer
US Patent
LigandPNGBDBM503719(US11034678, Example 3.5)
Affinity DataIC50:  238nM. Assay description: For determination of IC50 values, the reactions were carried out in 384-well white Polyplates (Perkin Elmer) in a total volume of 20 μL. To 1 &#...
Ligand InfoPC cidPC sid
In DepthDetails US Patent