BDBM50372050 CHEMBL255906
SMILES CCOc1ccccc1CC(=O)NS(=O)(=O)Cc1ccc(N2Cc3c(C2=O)c(OCC)c2cccnc2c3OCC)c(C)c1
InChI Key InChIKey=UOWXHKLPYRMISK-UHFFFAOYSA-N
Data  2 KI
  Tab Delimited (TSV)   2D SDfile   Computed 3D by Vconf -m prep SDfile
Find this compound or compounds like it in BindingDB:
Activity Spreadsheet -- Enzyme Inhibition Constant Data from BindingDB
Found 2 hits for monomerid = 50372050
TargetProstaglandin E2 receptor EP4 subtype(Homo sapiens (Human))
Merck Frosst Centre For Therapeutic Research
Curated by ChEMBL
LigandPNGBDBM50372050(CHEMBL255906)
Affinity DataKi:  0.270nM. Assay description: Binding affinity to human EP4 receptor expressed in HEK293 cells
In DepthDetails ArticlePubMed
TargetProstaglandin E2 receptor EP4 subtype(Homo sapiens (Human))
Merck Frosst Centre For Therapeutic Research
Curated by ChEMBL
LigandPNGBDBM50372050(CHEMBL255906)
Affinity DataKi:  8.90nM. Assay description: Binding affinity to human EP4 receptor expressed in HEK293 cells in presence of 10% human serum
In DepthDetails ArticlePubMed