BDBM50372054 CHEMBL255527
SMILES CCOc1c2CN(C(=O)c2c(OCC)c2ccccc12)c1ccc(CS(=O)(=O)NC(=O)Cc2ccccc2)cc1C
InChI Key InChIKey=BHXKXWYQXVARLG-UHFFFAOYSA-N
Data  2 KI
  Tab Delimited (TSV)   2D SDfile   Computed 3D by Vconf -m prep SDfile
Find this compound or compounds like it in BindingDB:
Activity Spreadsheet -- Enzyme Inhibition Constant Data from BindingDB
Found 2 hits for monomerid = 50372054
TargetProstaglandin E2 receptor EP4 subtype(Homo sapiens (Human))
Merck Frosst Centre For Therapeutic Research
Curated by ChEMBL
LigandPNGBDBM50372054(CHEMBL255527)
Affinity DataKi:  0.25nM. Assay description: Binding affinity to human EP4 receptor expressed in HEK293 cells
In DepthDetails ArticlePubMed
TargetProstaglandin E2 receptor EP4 subtype(Homo sapiens (Human))
Merck Frosst Centre For Therapeutic Research
Curated by ChEMBL
LigandPNGBDBM50372054(CHEMBL255527)
Affinity DataKi:  29nM. Assay description: Binding affinity to human EP4 receptor expressed in HEK293 cells in presence of 10% human serum
In DepthDetails ArticlePubMed