BDBM50372612 CHEMBL401910
SMILES CC(C)C[C@H]1N([C@@H](C(=O)NC(C)C)c2coc(C)n2)C(=O)[C@H](NC1=O)C1Cc2ccccc2C1
InChI Key InChIKey=PLXQKDCMQVUJJI-DNVJHFABSA-N
Data  1 IC50
  Tab Delimited (TSV)   2D SDfile   Computed 3D by Vconf -m prep SDfile
Find this compound or compounds like it in BindingDB:
Activity Spreadsheet -- Enzyme Inhibition Constant Data from BindingDB
Found 1 hit for monomerid = 50372612
TargetCytochrome P450 3A4(Homo sapiens (Human))
Glaxosmithkline
Curated by ChEMBL
LigandPNGBDBM50372612(CHEMBL401910)
Affinity DataIC50: >1.00E+5nM. Assay description: Inhibition of CYP3A4
In DepthDetails ArticlePubMed