BDBM50372714 CHEMBL255989
SMILES COc1nc(NCCCN2CCN(C)CC2)ncc1C(=O)Nc1cc(ccc1C)C(=O)Nc1cccc(c1C)C(F)(F)F
InChI Key InChIKey=IZGPDIJRXUJVSZ-UHFFFAOYSA-N
Data  4 IC50
  Tab Delimited (TSV)   2D SDfile   Computed 3D by Vconf -m prep SDfile
Find this compound or compounds like it in BindingDB:
Activity Spreadsheet -- Enzyme Inhibition Constant Data from BindingDB
Found 4 hits for monomerid = 50372714
TargetTyrosine-protein kinase Lck(Homo sapiens (Human))
Amgen
Curated by ChEMBL
LigandPNGBDBM50372714(CHEMBL255989)
Affinity DataIC50:  19nM. Assay description: Inhibition of Lck by HTRF assay
In DepthDetails ArticlePubMed
TargetAngiopoietin-1 receptor(Homo sapiens (Human))
Amgen
Curated by ChEMBL
LigandPNGBDBM50372714(CHEMBL255989)
Affinity DataIC50: >2.50E+4nM. Assay description: Inhibition of Tie2
In DepthDetails ArticlePubMed
TargetTyrosine-protein kinase JAK3(Homo sapiens (Human))
Amgen
Curated by ChEMBL
LigandPNGBDBM50372714(CHEMBL255989)
Affinity DataIC50: >2.50E+4nM. Assay description: Inhibition of Jak3
In DepthDetails ArticlePubMed
TargetVascular endothelial growth factor receptor 2(Homo sapiens (Human))
Amgen
Curated by ChEMBL
LigandPNGBDBM50372714(CHEMBL255989)
Affinity DataIC50: >2.50E+4nM. Assay description: Inhibition of KDR
In DepthDetails ArticlePubMed