BDBM50372715 CHEMBL271101
SMILES CNc1ncc(C(=O)Nc2cc(ccc2C)C(=O)Nc2cccc(c2C)C(F)(F)F)c(OC)n1
InChI Key InChIKey=HDZJMFILKBJUIC-UHFFFAOYSA-N
Data  5 IC50
  Tab Delimited (TSV)   2D SDfile   Computed 3D by Vconf -m prep SDfile
Find this compound or compounds like it in BindingDB:
Activity Spreadsheet -- Enzyme Inhibition Constant Data from BindingDB
Found 5 hits for monomerid = 50372715
TargetTyrosine-protein kinase Lck(Homo sapiens (Human))
Amgen
Curated by ChEMBL
LigandPNGBDBM50372715(CHEMBL271101)
Affinity DataIC50:  44nM. Assay description: Inhibition of Lck by HTRF assay
In DepthDetails ArticlePubMed
TargetVascular endothelial growth factor receptor 2(Homo sapiens (Human))
Amgen
Curated by ChEMBL
LigandPNGBDBM50372715(CHEMBL271101)
Affinity DataIC50: >2.50E+4nM. Assay description: Inhibition of KDR
In DepthDetails ArticlePubMed
TargetMitogen-activated protein kinase 14(Homo sapiens (Human))
Amgen
Curated by ChEMBL
LigandPNGBDBM50372715(CHEMBL271101)
Affinity DataIC50: >1.00E+4nM. Assay description: Inhibition of p38alpha
In DepthDetails ArticlePubMed
TargetAngiopoietin-1 receptor(Homo sapiens (Human))
Amgen
Curated by ChEMBL
LigandPNGBDBM50372715(CHEMBL271101)
Affinity DataIC50: >2.50E+4nM. Assay description: Inhibition of Tie2
In DepthDetails ArticlePubMed
TargetTyrosine-protein kinase JAK3(Homo sapiens (Human))
Amgen
Curated by ChEMBL
LigandPNGBDBM50372715(CHEMBL271101)
Affinity DataIC50: >2.50E+4nM. Assay description: Inhibition of Jak3
In DepthDetails ArticlePubMed