BDBM50372895 CHEMBL408967
SMILES COc1cc2[C@H]3CC[C@]4(C)[C@@H](CC#N)CC[C@H]4[C@@H]3CCc2cc1OS(N)(=O)=O
InChI Key InChIKey=NTSPHKOMJMBWOU-NNKXXINSSA-N
Data  2 KI  2 IC50
PDB links: 1 PDB ID matches this monomer.
  Tab Delimited (TSV)   2D SDfile   Computed 3D by Vconf -m prep SDfile
Find this compound or compounds like it in BindingDB:
Activity Spreadsheet -- Enzyme Inhibition Constant Data from BindingDB
Found 4 hits for monomerid = 50372895
TargetCarbonic anhydrase 9(Homo sapiens (Human))
University Of Florida
Curated by ChEMBL
LigandPNGBDBM50372895(CHEMBL408967)
Affinity DataKi:  750nM. Assay description: Inhibition of carbonic anhydrase 9 (unknown origin) expressed in Escherichia coli BL21 by stopped-flow CO2 hydration assay
In DepthDetails ArticlePubMed
TargetCarbonic anhydrase 2(Homo sapiens (Human))
University Of Florida
Curated by ChEMBL
LigandPNGBDBM50372895(CHEMBL408967)
Affinity DataKi:  1.47E+3nM. Assay description: Inhibition of carbonic anhydrase 2 (unknown origin) by stopped-flow CO2 hydration assay
TargetCarbonic anhydrase 2(Homo sapiens (Human))
University Of Florida
Curated by ChEMBL
LigandPNGBDBM50372895(CHEMBL408967)
Affinity DataIC50:  1.50E+3nM. Assay description: Inhibition of human carbonic anhydrase 2
TargetSteryl-sulfatase(Homo sapiens (Human))
University Of Bath
Curated by ChEMBL
LigandPNGBDBM50372895(CHEMBL408967)
Affinity DataIC50:  130nM. Assay description: Inhibition of steroid sulfatase-mediated coversion of [3H]E1S to E1
In DepthDetails ArticlePubMed