BDBM50373232 CHEMBL257151
SMILES Cc1cc(=O)[nH]c2ccc-3c(COc4cccc(CO)c-34)c12
InChI Key InChIKey=HNYRSZRBOVPOHQ-UHFFFAOYSA-N
Data  1 KI  2 IC50  1 EC50
  Tab Delimited (TSV)   2D SDfile   Computed 3D by Vconf -m prep SDfile
Find this compound or compounds like it in BindingDB:
Activity Spreadsheet -- Enzyme Inhibition Constant Data from BindingDB
Found 4 hits for monomerid = 50373232
TargetAndrogen receptor(Homo sapiens (Human))
Ligand Pharmaceuticals
Curated by ChEMBL
LigandPNGBDBM50373232(CHEMBL257151)
Affinity DataKi:  26nM. Assay description: Binding affinity to human androgen receptor expressed in monkey COS7 cells by whole cell binding assay
In DepthDetails ArticlePubMed
TargetAndrogen receptor(Homo sapiens (Human))
Ligand Pharmaceuticals
Curated by ChEMBL
LigandPNGBDBM50373232(CHEMBL257151)
Affinity DataIC50:  0.300nM. Assay description: Activity at androgen receptor in human Saos2 cells assessed as IL6 repression
In DepthDetails ArticlePubMed
TargetAndrogen receptor(Homo sapiens (Human))
Ligand Pharmaceuticals
Curated by ChEMBL
LigandPNGBDBM50373232(CHEMBL257151)
Affinity DataEC50:  12nM. Assay description: Agonist activity at human androgen receptor african green monkey CV1 cells by cotransfection assay
In DepthDetails ArticlePubMed
TargetAndrogen receptor(Homo sapiens (Human))
Ligand Pharmaceuticals
Curated by ChEMBL
LigandPNGBDBM50373232(CHEMBL257151)
Affinity DataIC50: >1.00E+4nM. Assay description: Antagonist activity at human androgen receptor african green monkey CV1 cells by cotransfection assay
In DepthDetails ArticlePubMed