BDBM50373829 CHEMBL429681
SMILES C[C@@H](CN1CCN(CC1)S(=O)(=O)c1ccccc1C)Nc1ncnc2c(C)csc12
InChI Key InChIKey=QHZZKPZSTGOWRD-KRWDZBQOSA-N
Data  1 IC50
  Tab Delimited (TSV)   2D SDfile   Computed 3D by Vconf -m prep SDfile
Find this compound or compounds like it in BindingDB:
Activity Spreadsheet -- Enzyme Inhibition Constant Data from BindingDB
Found 1 hit for monomerid = 50373829
TargetLysophosphatidic acid receptor 2(Homo sapiens (Human))
Amgen
Curated by ChEMBL
LigandPNGBDBM50373829(CHEMBL429681)
Affinity DataIC50:  730nM. Assay description: Antagonist activity at LPA2 expressed in RH7777 cells with Gi4-protein and aequorin by calcium mobilization assay
In DepthDetails ArticlePubMed