BDBM50373892 CHEMBL261600
SMILES COc1ccccc1N1CCN(CCCCNc2ccc3cc(C)ccc3n2)CC1
InChI Key InChIKey=LTAWZNAXYRQBIM-UHFFFAOYSA-N
Data  1 KI
  Tab Delimited (TSV)   2D SDfile   Computed 3D by Vconf -m prep SDfile
Find this compound or compounds like it in BindingDB:
Activity Spreadsheet -- Enzyme Inhibition Constant Data from BindingDB
Found 1 hit for monomerid = 50373892
Target5-hydroxytryptamine receptor 1A(Homo sapiens (Human))
Universita Degli Studi Di Bari
Curated by ChEMBL
LigandPNGBDBM50373892(CHEMBL261600)
Affinity DataKi:  0.540nM. Assay description: Displacement of [3H]8-OH-DPAT from human 5HT1A receptor expressed in HEK293 cells after 120 mins
In DepthDetails ArticlePubMed