BDBM50373894 CHEMBL270736
SMILES COc1ccc2ccc(NCCCCN3CCN(CC3)c3ccccc3OC)nc2c1
InChI Key InChIKey=DQPJFBDJGHOLKV-UHFFFAOYSA-N
Data  1 KI
  Tab Delimited (TSV)   2D SDfile   Computed 3D by Vconf -m prep SDfile
Find this compound or compounds like it in BindingDB:
Activity Spreadsheet -- Enzyme Inhibition Constant Data from BindingDB
Found 1 hit for monomerid = 50373894
Target5-hydroxytryptamine receptor 1A(Homo sapiens (Human))
Universita Degli Studi Di Bari
Curated by ChEMBL
LigandPNGBDBM50373894(CHEMBL270736)
Affinity DataKi:  4.60nM. Assay description: Displacement of [3H]8-OH-DPAT from human 5HT1A receptor expressed in HEK293 cells after 120 mins
In DepthDetails ArticlePubMed